Target
Aurora kinase B
Ligand
BDBM50310621
Substrate
Meas. Tech.
ChEMBL_620386 (CHEMBL1112281)
IC50
5±n/a nM
Citation
 Zhong, MBui, MShen, WBaskaran, SAllen, DAElling, RAFlanagan, WMFung, ADHanan, EJHarris, SOHeumann, SAHoch, UIvy, SNJacobs, JWLam, SLee, HMcDowell, RSOslob, JDPurkey, HERomanowski, MJSilverman, JATangonan, BTTaverna, PYang, WYoburn, JCYu, CHZimmerman, KMO'Brien, TLew, W 2-Aminobenzimidazoles as potent Aurora kinase inhibitors. Bioorg Med Chem Lett 19:5158-61 (2009)  
Target
Name:
Aurora kinase B
Synonyms:
AIK2 AIM1 ARK2 AURKB_HUMAN Aurora B-INCENP Aurora kinase B (AURKB) STK-1 STK12 Serine/threonine-protein kinase aurora B
Type:
Protein
Mol. Mass.:
39327.72
Organism:
Homo sapiens (Human)
Description:
Q96GD4
Residue:
344
  
Inhibitor
Name:
BDBM50310621
Synonyms:
CHEMBL1079538 | N-(4-(6-(trifluoromethyl)-3H-imidazo[4,5-b]pyridin-2-ylamino)phenethyl)thieno[3,2-d]pyrimidin-4-amine
Type:
Small organic molecule
Emp. Form.:
C21H16F3N7S
Mol. Mass.:
455.459
SMILES:
FC(F)(F)c1cnc2nc(Nc3ccc(CCNc4ncnc5ccsc45)cc3)[nH]c2c1
: