Target
Sodium-dependent noradrenaline transporter
Ligand
BDBM50310646
Substrate
Meas. Tech.
ChEMBL_620407 (CHEMBL1112302)
Ki
10±n/a nM
Citation
 Wakenhut, FAllan, GAFish, PVFray, MJHarrison, ACMcCoy, RPhillips, SCRyckmans, TStobie, AWestbrook, DWestbrook, SLWhitlock, GA N-[(3S)-Pyrrolidin-3-yl]benzamides as novel dual serotonin and noradrenaline reuptake inhibitors: impact of small structural modifications on P-gp recognition and CNS penetration. Bioorg Med Chem Lett 19:5078-81 (2009)  
Target
Name:
Sodium-dependent noradrenaline transporter
Synonyms:
Monoamine transporter NET Noradrenaline Transporter (NET) Norepinephrine transporter protein (NET) SLC6A2 Sodium-dependent noradrenaline transporter (NET) | Solute carrier family 6 member 2
Type:
Multi-pass membrane protein
Mol. Mass.:
69337.72
Organism:
Homo sapiens (Human)
Description:
P23975
Residue:
617
  
Inhibitor
Name:
BDBM50310646
Synonyms:
(S)-2,3-dichloro-N-(2H-pyran-4-yl)-N-(pyrrolidin-3-yl)benzamide | CHEMBL1079263
Type:
Small organic molecule
Emp. Form.:
C16H16Cl2N2O2
Mol. Mass.:
339.216
SMILES:
Clc1cccc(C(=O)N([C@H]2CCNC2)C2=CCOC=C2)c1Cl
: