Target
Epoxide hydrolase 1
Ligand
BDBM50310793
Substrate
Meas. Tech.
ChEMBL_621475 (CHEMBL1100146)
IC50
>100000±n/a nM
Citation
 Shen, HCDing, FXDeng, QXu, SChen, HSTong, XTong, VZhang, XChen, YZhou, GPai, LYAlonso-Galicia, MZhang, BRoy, STata, JRBerger, JPColletti, SL Discovery of 3,3-disubstituted piperidine-derived trisubstituted ureas as highly potent soluble epoxide hydrolase inhibitors. Bioorg Med Chem Lett 19:5314-20 (2009)  
Target
Name:
Epoxide hydrolase 1
Synonyms:
EPHX EPOX Epoxide hydrolase (HsEH) HYEP_HUMAN | Microsomal epoxide hydrolase
Type:
Protein
Mol. Mass.:
52954.28
Organism:
Homo sapiens (Human)
Description:
P07099
Residue:
455
  
Inhibitor
Name:
BDBM50310793
Synonyms:
CHEMBL1079291 | N-(4-chlorophenyl)-3-(3-hydroxypropyl)-3-phenylpiperidine-1-carboxamide
Type:
Small organic molecule
Emp. Form.:
C21H25ClN2O2
Mol. Mass.:
372.888
SMILES:
OCCCC1(CCCN(C1)C(=O)Nc1ccc(Cl)cc1)c1ccccc1
: