Target
Sodium channel protein type 5 subunit alpha
Ligand
BDBM50310793
Substrate
Meas. Tech.
ChEMBL_621481 (CHEMBL1100152)
IC50
>10000±n/a nM
Citation
 Shen, HCDing, FXDeng, QXu, SChen, HSTong, XTong, VZhang, XChen, YZhou, GPai, LYAlonso-Galicia, MZhang, BRoy, STata, JRBerger, JPColletti, SL Discovery of 3,3-disubstituted piperidine-derived trisubstituted ureas as highly potent soluble epoxide hydrolase inhibitors. Bioorg Med Chem Lett 19:5314-20 (2009)  
Target
Name:
Sodium channel protein type 5 subunit alpha
Synonyms:
HH1 SCN5A_HUMAN Sodium channel protein type 5 subunit alpha/beta-1/beta-2 Voltage-gated sodium channel subunit alpha Nav1.5
Type:
Enzyme
Mol. Mass.:
226908.60
Organism:
Homo sapiens (Human)
Description:
Q14524
Residue:
2016
  
Inhibitor
Name:
BDBM50310793
Synonyms:
CHEMBL1079291 | N-(4-chlorophenyl)-3-(3-hydroxypropyl)-3-phenylpiperidine-1-carboxamide
Type:
Small organic molecule
Emp. Form.:
C21H25ClN2O2
Mol. Mass.:
372.888
SMILES:
OCCCC1(CCCN(C1)C(=O)Nc1ccc(Cl)cc1)c1ccccc1
: