Target
72 kDa type IV collagenase
Ligand
BDBM50310831
Substrate
Meas. Tech.
ChEMBL_622215 (CHEMBL1106839)
IC50
>100000±n/a nM
Citation
 Murata, TSasaki, KSato, KYoshizaki, FYamada, HMutoh, HUmehara, KMiyase, TWarashina, TAoshima, HTabata, HMatsubara, K Matrix metalloproteinase-2 inhibitors from Clinopodium chinense var. parviflorum. J Nat Prod 72:1379-84 (2009)  
Target
Name:
72 kDa type IV collagenase
Synonyms:
72 kDa type IV collagenase Matrix metalloproteinase-2 (MMP-2) | Mmp2
Type:
Mol. Mass.:
74137.51
Organism:
Rattus norvegicus (Rat)
Description:
P33436
Residue:
662
  
Inhibitor
Name:
BDBM50310831
Synonyms:
CHEMBL1079231 | Clinopodic acid A
Type:
Small organic molecule
Emp. Form.:
C18H16O7
Mol. Mass.:
344.3154
SMILES:
OC(=O)[C@@H](Cc1ccc(O)c(O)c1)OC(=O)\C=C\c1ccc(O)cc1
: