Target
Telomerase reverse transcriptase
Ligand
BDBM50155666
Substrate
Meas. Tech.
ChEMBL_622825 (CHEMBL1105835)
IC50
2300±n/a nM
Citation
 Castillo-González, DCabrera-Pérez, MAPérez-González, MMorales Helguera, ADurán-Martínez, A Prediction of telomerase inhibitory activity for acridinic derivatives based on chemical structure. Eur J Med Chem 44:4826-40 (2009)  
Target
Name:
Telomerase reverse transcriptase
Synonyms:
EST2 TERT TRT
Type:
PROTEIN
Mol. Mass.:
127099.03
Organism:
Homo sapiens (Human)
Description:
ChEMBL_1447029
Residue:
1132
  
Inhibitor
Name:
BDBM50155666
Synonyms:
3-(4-Hydroxy-piperidin-1-yl)-N-{7-[3-(4-hydroxy-piperidin-1-yl)-propionylamino]-9-oxo-9,10-dihydro-acridin-2-yl}-propionamide CHEMBL365069
Type:
Small organic molecule
Emp. Form.:
C29H37N5O5
Mol. Mass.:
535.6346
SMILES:
OC1CCN(CCC(=O)Nc2ccc3nc4ccc(NC(=O)CCN5CCC(O)CC5)cc4c(O)c3c2)CC1
: