Target
Adenosine receptor A2b
Ligand
BDBM50310904
Substrate
Meas. Tech.
ChEMBL_622829 (CHEMBL1105839)
IC50
287±n/a nM
Citation
 Bedford, STBenwell, KRBrooks, TChen, IComer, MDugdale, SHaymes, TJordan, AMKennett, GAKnight, ARKlenke, BLeStrat, LMerrett, AMisra, ALightowler, SPadfield, APoullennec, KReece, MSimmonite, HWong, MYule, IA Discovery and optimization of potent and selective functional antagonists of the human adenosine A2B receptor. Bioorg Med Chem Lett 19:5945-9 (2009)  
Target
Name:
Adenosine receptor A2b
Synonyms:
AA2BR_HUMAN ADORA2B Adenosine receptors A2b | Adenosine receptors; A2a & A2b
Type:
G Protein-Coupled Receptor (GPCR)
Mol. Mass.:
36341.22
Organism:
Homo sapiens (Human)
Description:
Residue:
332
  
Inhibitor
Name:
BDBM50310904
Synonyms:
CHEMBL1078001 | N-(4-(5-methylthiophene-2-carbonyl)thieno[3,2-d]pyrimidin-2-yl)nicotinamide
Type:
Small organic molecule
Emp. Form.:
C18H12N4O2S2
Mol. Mass.:
380.443
SMILES:
Cc1ccc(s1)C(=O)c1nc(NC(=O)c2cccnc2)nc2ccsc12
: