Target
Adenosine receptor A2a
Ligand
BDBM50310925
Substrate
Meas. Tech.
ChEMBL_622830 (CHEMBL1105840)
IC50
1417±n/a nM
Citation
 Bedford, STBenwell, KRBrooks, TChen, IComer, MDugdale, SHaymes, TJordan, AMKennett, GAKnight, ARKlenke, BLeStrat, LMerrett, AMisra, ALightowler, SPadfield, APoullennec, KReece, MSimmonite, HWong, MYule, IA Discovery and optimization of potent and selective functional antagonists of the human adenosine A2B receptor. Bioorg Med Chem Lett 19:5945-9 (2009)  
Target
Name:
Adenosine receptor A2a
Synonyms:
A2A adenosine receptor (hA2A) ADENOSINE A2 ADORA2 Adenosine A2A receptor (A2AAR)
Type:
G Protein-Coupled Receptor (GPCR)
Mol. Mass.:
44716.46
Organism:
Homo sapiens (Human)
Description:
P29274
Residue:
412
  
Inhibitor
Name:
BDBM50310925
Synonyms:
CHEMBL1081160 {6-dimethylamino-2-[(pyridine-3-ylmethyl)-amino]-thieno[3,2-d]pyrimidin-4-yl}-thiophen-2-yl-methanone
Type:
Small organic molecule
Emp. Form.:
C19H17N5OS2
Mol. Mass.:
395.501
SMILES:
CN(C)c1cc2nc(NCc3cccnc3)nc(C(=O)c3cccs3)c2s1
: