Target
Adenosine receptor A2a
Ligand
BDBM50310928
Substrate
Meas. Tech.
ChEMBL_622830 (CHEMBL1105840)
IC50
2610±n/a nM
Citation
 Bedford, STBenwell, KRBrooks, TChen, IComer, MDugdale, SHaymes, TJordan, AMKennett, GAKnight, ARKlenke, BLeStrat, LMerrett, AMisra, ALightowler, SPadfield, APoullennec, KReece, MSimmonite, HWong, MYule, IA Discovery and optimization of potent and selective functional antagonists of the human adenosine A2B receptor. Bioorg Med Chem Lett 19:5945-9 (2009)  
Target
Name:
Adenosine receptor A2a
Synonyms:
A2A adenosine receptor (hA2A) ADENOSINE A2 ADORA2 Adenosine A2A receptor (A2AAR)
Type:
G Protein-Coupled Receptor (GPCR)
Mol. Mass.:
44716.46
Organism:
Homo sapiens (Human)
Description:
P29274
Residue:
412
  
Inhibitor
Name:
BDBM50310928
Synonyms:
2-[(Pyridin-3-ylmethyl)-amino]-thieno[3,2-d]pyrimidine-4-carboxylic acid iso-propylamide | CHEMBL1076504
Type:
Small organic molecule
Emp. Form.:
C16H17N5OS
Mol. Mass.:
327.404
SMILES:
CC(C)NC(=O)c1nc(NCc2cccnc2)nc2ccsc12
: