Target
Serine/threonine-protein kinase mTOR
Ligand
BDBM50310989
Substrate
Meas. Tech.
ChEMBL_619474 (CHEMBL1107750)
IC50
100.0±n/a nM
Citation
 Malagu, KDuggan, HMenear, KHummersone, MGomez, SBailey, CEdwards, PDrzewiecki, JLeroux, FQuesada, MJHermann, GMaine, SMolyneaux, CALe Gall, APullen, JHickson, ISmith, LMaguire, SMartin, NSmith, GPass, M The discovery and optimisation of pyrido[2,3-d]pyrimidine-2,4-diamines as potent and selective inhibitors of mTOR kinase. Bioorg Med Chem Lett 19:5950-3 (2009)  
Target
Name:
Serine/threonine-protein kinase mTOR
Synonyms:
FK506-binding protein 12-rapamycin complex-associated protein 1 FRAP FRAP1 MTOR Mammalian Target of Rapamycin (mTOR) RAFT1 Rapamycin and FKBP12 target 1 Serine/threonine-protein kinase (mTOR) | mTORC2
Type:
Rapamycin target protein
Mol. Mass.:
288917.12
Organism:
Homo sapiens (Human)
Description:
P42345
Residue:
2549
  
Inhibitor
Name:
BDBM50310989
Synonyms:
(5-(2-((2R,6S)-2,6-dimethylmorpholino)-4-morpholinopyrido[2,3-d]pyrimidin-7-yl)-2-methoxyphenyl)methanol | CHEMBL1078983
Type:
Small organic molecule
Emp. Form.:
C25H31N5O4
Mol. Mass.:
465.5447
SMILES:
COc1ccc(cc1CO)-c1ccc2c(nc(nc2n1)N1C[C@H](C)O[C@H](C)C1)N1CCOCC1
: