Target
Cytochrome P450 2D6
Ligand
BDBM50311414
Substrate
Meas. Tech.
ChEMBL_622573 (CHEMBL1109285)
IC50
200±n/a nM
Citation
 Bailey, JMScott, JSBasilla, JBBolton, VJBoyfield, IEvans, DGFleury, EHeightman, TDJarvie, EMLawless, KMatthews, KLMcKay, FMok, HMuir, AOrlek, BSSanger, GJStemp, GStevens, AJThompson, MWard, JVaidya, KWestaway, SM The discovery and optimisation of benzazepine sulfonamide and sulfones as potent agonists of the motilin receptor. Bioorg Med Chem Lett 19:6452-8 (2009)  
Target
Name:
Cytochrome P450 2D6
Synonyms:
CP2D6_HUMAN CYP2DL1 Cytochrome P450 2D6 (CYP2D6) P450-DB1
Type:
Protein
Mol. Mass.:
55774.82
Organism:
Homo sapiens (Human)
Description:
P10635
Residue:
497
  
Inhibitor
Name:
BDBM50311414
Synonyms:
CHEMBL1078492 | N-(3-((1H-pyrazol-3-yl)methyl)-2,3,4,5-tetrahydro-1H-benzo[d]azepin-7-yl)-5-(pyridin-2-yl)thiophene-2-sulfonamide
Type:
Small organic molecule
Emp. Form.:
C23H23N5O2S2
Mol. Mass.:
465.591
SMILES:
O=S(=O)(Nc1ccc2CCN(Cc3ccn[nH]3)CCc2c1)c1ccc(s1)-c1ccccn1
: