Target
Motilin receptor
Ligand
BDBM50311412
Substrate
Meas. Tech.
ChEMBL_622559 (CHEMBL1117503)
EC50
2.51±n/a nM
Citation
 Bailey, JMScott, JSBasilla, JBBolton, VJBoyfield, IEvans, DGFleury, EHeightman, TDJarvie, EMLawless, KMatthews, KLMcKay, FMok, HMuir, AOrlek, BSSanger, GJStemp, GStevens, AJThompson, MWard, JVaidya, KWestaway, SM The discovery and optimisation of benzazepine sulfonamide and sulfones as potent agonists of the motilin receptor. Bioorg Med Chem Lett 19:6452-8 (2009)  
Target
Name:
Motilin receptor
Synonyms:
G-protein coupled receptor 38 MLNR MTLR1 | MTLR_HUMAN
Type:
PROTEIN
Mol. Mass.:
45365.95
Organism:
Homo sapiens (Human)
Description:
ChEMBL_122664
Residue:
412
  
Inhibitor
Name:
BDBM50311412
Synonyms:
CHEMBL1080046 | N-(3-((1H-pyrazol-3-yl)methyl)-2,3,4,5-tetrahydro-1H-benzo[d]azepin-7-yl)-4-butylbenzenesulfonamide
Type:
Small organic molecule
Emp. Form.:
C24H30N4O2S
Mol. Mass.:
438.586
SMILES:
CCCCc1ccc(cc1)S(=O)(=O)Nc1ccc2CCN(Cc3ccn[nH]3)CCc2c1
: