Target
Nociceptin receptor
Ligand
BDBM50311475
Substrate
Meas. Tech.
ChEMBL_622957 (CHEMBL1112209)
Ki
1.7±n/a nM
Citation
 Palin, RClark, JKEvans, LFeilden, HFletcher, DHamilton, NMHoughton, AKJones, PSMcArthur, DMontgomery, BRatcliffe, PDSmith, ARSutherland, AWeston, MAWishart, G Rapid access towards follow-up NOP receptor agonists using a knowledge based approach. Bioorg Med Chem Lett 19:6441-6 (2009)  
Target
Name:
Nociceptin receptor
Synonyms:
KOR-3 Mu-type opioid receptor (Mu) Nociceptin Receptor (ORL1 Receptor) Nociceptin receptor (ORL-1) Nociceptin/Orphanin FQ, NOP receptor OPIATE ORL-1 OPRL1 protein ORL1 Opioid receptor like-1 Orphanin FQ receptor (ORL1) | P41146
Type:
G Protein-Coupled Receptor (GPCR)
Mol. Mass.:
40702.87
Organism:
Homo sapiens (Human)
Description:
P41146
Residue:
370
  
Inhibitor
Name:
BDBM50311475
Synonyms:
2-(3-(1-((1s,4s)-4-isopropylcyclohexyl)piperidin-4-yl)-2-oxo-2,3-dihydro-1H-benzo[d]imidazol-1-yl)-N-methylacetamide | CHEMBL1080485
Type:
Small organic molecule
Emp. Form.:
C24H36N4O2
Mol. Mass.:
412.5682
SMILES:
CNC(=O)Cn1c2ccccc2n(C2CCN(CC2)[C@@H]2CC[C@@H](CC2)C(C)C)c1=O
: