Target
Peroxisome proliferator-activated receptor delta
Ligand
BDBM50311792
Substrate
Meas. Tech.
ChEMBL_619891 (CHEMBL1110281)
EC50
11±n/a nM
Citation
 Kasuga, JIshida, SYamasaki, DMakishima, MDoi, THashimoto, YMiyachi, H Novel biphenylcarboxylic acid peroxisome proliferator-activated receptor (PPAR) delta selective antagonists. Bioorg Med Chem Lett 19:6595-9 (2009)  
Target
Name:
Peroxisome proliferator-activated receptor delta
Synonyms:
NR1C2 NUCI Nuclear receptor subfamily 1 group C member 2 PPAR-beta PPARD Peroxisome proliferator-activated receptor Peroxisome proliferator-activated receptor delta
Type:
Enzyme
Mol. Mass.:
49910.45
Organism:
Homo sapiens (Human)
Description:
Q03181
Residue:
441
  
Inhibitor
Name:
BDBM50311792
Synonyms:
4'-butoxy-3'-((2-fluoro-4-(trifluoromethyl)benzamido)methyl)-2-methylbiphenyl-4-carboxylic acid | CHEMBL1082079
Type:
Small organic molecule
Emp. Form.:
C27H25F4NO4
Mol. Mass.:
503.4853
SMILES:
CCCCOc1ccc(cc1CNC(=O)c1ccc(cc1F)C(F)(F)F)-c1ccc(cc1C)C(O)=O
: