Target
Insulin receptor
Ligand
BDBM50311895
Substrate
Meas. Tech.
ChEMBL_619940 (CHEMBL1113982)
IC50
>10000±n/a nM
Citation
 Zhang, GRen, PGray, NSSim, TWang, XLiu, YChe, JDong, WTian, SSSandberg, MLSpalding, TARomeo, RIskandar, MWang, ZSeidel, HMKaranewsky, DSHe, Y Discovery of pyrimidine benzimidazoles as Src-family selective Lck inhibitors. Part II. Bioorg Med Chem Lett 19:6691-5 (2009)  
Target
Name:
Insulin receptor
Synonyms:
INSR INSR_HUMAN Insulin receptor beta subunit
Type:
Receptor Tyrosine Kinase
Mol. Mass.:
156322.60
Organism:
Homo sapiens (Human)
Description:
P06213
Residue:
1382
  
Inhibitor
Name:
BDBM50311895
Synonyms:
CHEMBL1076480 | N-(3-(1-(6-(2-methoxyethylamino)pyrimidin-4-yl)-1H-benzo[d]imidazol-2-ylamino)-4-methylphenyl)-3-(trifluoromethyl)benzamide
Type:
Small organic molecule
Emp. Form.:
C29H26F3N7O2
Mol. Mass.:
561.5576
SMILES:
COCCNc1cc(ncn1)-n1c(Nc2cc(NC(=O)c3cccc(c3)C(F)(F)F)ccc2C)nc2ccccc12
: