Target
Tyrosine-protein kinase Lyn
Ligand
BDBM50311921
Substrate
Meas. Tech.
ChEMBL_619937 (CHEMBL1113979)
IC50
5±n/a nM
Citation
 Zhang, GRen, PGray, NSSim, TWang, XLiu, YChe, JDong, WTian, SSSandberg, MLSpalding, TARomeo, RIskandar, MWang, ZSeidel, HMKaranewsky, DSHe, Y Discovery of pyrimidine benzimidazoles as Src-family selective Lck inhibitors. Part II. Bioorg Med Chem Lett 19:6691-5 (2009)  
Target
Name:
Tyrosine-protein kinase Lyn
Synonyms:
JTK8 LYN_HUMAN Tyrosine-protein kinase Lyn (LYN) p53Lyn | p56Lyn
Type:
Protein
Mol. Mass.:
58575.92
Organism:
Homo sapiens (Human)
Description:
P07948
Residue:
512
  
Inhibitor
Name:
BDBM50311921
Synonyms:
CHEMBL1086731 | N-(3-(1-(6-aminopyrimidin-4-yl)-1H-benzo[d]imidazol-2-ylamino)-4-methylphenyl)-5-tert-butylthiophene-2-carboxamide
Type:
Small organic molecule
Emp. Form.:
C27H27N7OS
Mol. Mass.:
497.615
SMILES:
Cc1ccc(NC(=O)c2ccc(s2)C(C)(C)C)cc1Nc1nc2ccccc2n1-c1cc(N)ncn1
: