Target
Protein kinase C theta type
Ligand
BDBM50302529
Substrate
Meas. Tech.
ChEMBL_619965 (CHEMBL1114007)
IC50
3.6±n/a nM
Citation
 Shim, JEid, CLee, JLiu, EChaudhary, DBoschelli, DH Synthesis and PKCtheta inhibitory activity of a series of 5-vinyl phenyl sulfonamide-3-pyridinecarbonitriles. Bioorg Med Chem Lett 19:6575-7 (2009)  
Target
Name:
Protein kinase C theta type
Synonyms:
KPCT_HUMAN PRKCT Protein kinase C theta type (PRKCQ) nPKC-theta
Type:
Serine/threonine-protein kinase
Mol. Mass.:
81878.04
Organism:
Homo sapiens (Human)
Description:
Full-length human PKC theta (Panvera Catalog No. P2996).
Residue:
706
  
Inhibitor
Name:
BDBM50302529
Synonyms:
4-(4-methyl-1H-indol-5-ylamino)-5-(4-(2-(4-methylpiperazin-1-yl)ethoxy)styryl)nicotinonitrile | CHEMBL568457
Type:
Small organic molecule
Emp. Form.:
C30H32N6O
Mol. Mass.:
492.6147
SMILES:
CN1CCN(CCOc2ccc(\C=C\c3cncc(C#N)c3Nc3ccc4[nH]ccc4c3C)cc2)CC1
: