Target
Protein kinase C delta type
Ligand
BDBM50311952
Substrate
Meas. Tech.
ChEMBL_619964 (CHEMBL1114006)
IC50
390±n/a nM
Citation
 Shim, JEid, CLee, JLiu, EChaudhary, DBoschelli, DH Synthesis and PKCtheta inhibitory activity of a series of 5-vinyl phenyl sulfonamide-3-pyridinecarbonitriles. Bioorg Med Chem Lett 19:6575-7 (2009)  
Target
Name:
Protein kinase C delta type
Synonyms:
KPCD_HUMAN PKCD Protein Kinase C- delta nPKC-delta
Type:
Enzyme
Mol. Mass.:
77516.79
Organism:
Homo sapiens (Human)
Description:
The recombinant human PKC enzymes were produced using a baculovirus expression system in SF9 cells
Residue:
676
  
Inhibitor
Name:
BDBM50311952
Synonyms:
4-(4-methyl-1H-indol-5-ylamino)-5-(3-(piperidin-1-ylsulfonyl)styryl)nicotinonitrile | CHEMBL1081359
Type:
Small organic molecule
Emp. Form.:
C28H27N5O2S
Mol. Mass.:
497.611
SMILES:
Cc1c(Nc2c(\C=C\c3cccc(c3)S(=O)(=O)N3CCCCC3)cncc2C#N)ccc2[nH]ccc12
: