Target
Protein kinase C delta type
Ligand
BDBM50311956
Substrate
Meas. Tech.
ChEMBL_619964 (CHEMBL1114006)
IC50
2000±n/a nM
Citation
 Shim, JEid, CLee, JLiu, EChaudhary, DBoschelli, DH Synthesis and PKCtheta inhibitory activity of a series of 5-vinyl phenyl sulfonamide-3-pyridinecarbonitriles. Bioorg Med Chem Lett 19:6575-7 (2009)  
Target
Name:
Protein kinase C delta type
Synonyms:
KPCD_HUMAN PKCD Protein Kinase C- delta nPKC-delta
Type:
Enzyme
Mol. Mass.:
77516.79
Organism:
Homo sapiens (Human)
Description:
The recombinant human PKC enzymes were produced using a baculovirus expression system in SF9 cells
Residue:
676
  
Inhibitor
Name:
BDBM50311956
Synonyms:
6-methyl-4-(4-methyl-1H-indol-5-ylamino)-5-(3-(piperidin-1-ylsulfonyl)styryl)nicotinonitrile | CHEMBL1079566
Type:
Small organic molecule
Emp. Form.:
C29H29N5O2S
Mol. Mass.:
511.638
SMILES:
Cc1ncc(C#N)c(Nc2ccc3[nH]ccc3c2C)c1\C=C\c1cccc(c1)S(=O)(=O)N1CCCCC1
: