Target
Protein kinase C delta type
Ligand
BDBM50311960
Substrate
Meas. Tech.
ChEMBL_619964 (CHEMBL1114006)
IC50
320±n/a nM
Citation
 Shim, JEid, CLee, JLiu, EChaudhary, DBoschelli, DH Synthesis and PKCtheta inhibitory activity of a series of 5-vinyl phenyl sulfonamide-3-pyridinecarbonitriles. Bioorg Med Chem Lett 19:6575-7 (2009)  
Target
Name:
Protein kinase C delta type
Synonyms:
KPCD_HUMAN PKCD Protein Kinase C- delta nPKC-delta
Type:
Enzyme
Mol. Mass.:
77516.79
Organism:
Homo sapiens (Human)
Description:
The recombinant human PKC enzymes were produced using a baculovirus expression system in SF9 cells
Residue:
676
  
Inhibitor
Name:
BDBM50311960
Synonyms:
4-(4-methyl-1H-indol-5-ylamino)-5-(4-((4-methylpiperazin-1-ylsulfonyl)methyl)styryl)nicotinonitrile | CHEMBL1081920
Type:
Small organic molecule
Emp. Form.:
C29H30N6O2S
Mol. Mass.:
526.653
SMILES:
CN1CCN(CC1)S(=O)(=O)Cc1ccc(\C=C\c2cncc(C#N)c2Nc2ccc3[nH]ccc3c2C)cc1
: