Target
Proto-oncogene tyrosine-protein kinase Src
Ligand
BDBM50311954
Substrate
Meas. Tech.
ChEMBL_619955 (CHEMBL1113997)
IC50
>50000±n/a nM
Citation
 Shim, JEid, CLee, JLiu, EChaudhary, DBoschelli, DH Synthesis and PKCtheta inhibitory activity of a series of 5-vinyl phenyl sulfonamide-3-pyridinecarbonitriles. Bioorg Med Chem Lett 19:6575-7 (2009)  
Target
Name:
Proto-oncogene tyrosine-protein kinase Src
Synonyms:
Calmodulin/Proto-oncogene tyrosine-protein kinase Src Proto-oncogene c-Src SRC SRC_HUMAN V-src sarcoma (Schmidt-Ruppin A-2) viral oncogene homolog (avian) p60-Src | pp60c-src
Type:
Protein
Mol. Mass.:
59838.60
Organism:
Homo sapiens (Human)
Description:
P12931
Residue:
536
  
Inhibitor
Name:
BDBM50311954
Synonyms:
6-methyl-4-(4-methyl-1H-indol-5-ylamino)-5-(3-(4-methylpiperazin-1-ylsulfonyl)styryl)nicotinonitrile | CHEMBL1080995
Type:
Small organic molecule
Emp. Form.:
C29H30N6O2S
Mol. Mass.:
526.653
SMILES:
CN1CCN(CC1)S(=O)(=O)c1cccc(\C=C\c2c(C)ncc(C#N)c2Nc2ccc3[nH]ccc3c2C)c1
: