Target
Serine/threonine-protein kinase B-raf
Ligand
BDBM50026028
Substrate
Meas. Tech.
ChEMBL_620206 (CHEMBL1115841)
IC50
<0.320000±n/a nM
Citation
 Wang, XBerger, DMSalaski, EJTorres, NHu, YLevin, JIPowell, DWojciechowicz, DCollins, KFrommer, E Discovery of highly potent and selective type I B-Raf kinase inhibitors. Bioorg Med Chem Lett 19:6571-4 (2009)  
Target
Name:
Serine/threonine-protein kinase B-raf
Synonyms:
B-RAF B-Raf proto-oncogene serine/threonine-protein kinase BRAF1 RAFB1 v-Raf murine sarcoma viral oncogene homolog B1
Type:
Serine/threonine-protein kinase
Mol. Mass.:
84446.00
Organism:
Homo sapiens (Human)
Description:
P15056
Residue:
766
  
Inhibitor
Name:
BDBM50026028
Synonyms:
CHEMBL1087001
Type:
Small organic molecule
Emp. Form.:
C29H26N6O
Mol. Mass.:
474.5563
SMILES:
[H][C@]12CN(c3ccc(c(C)c3)-c3ccnc4c(c(nn34)-c3ccncc3)-c3cccc(O)c3)[C@]([H])(CN1)C2
: