Target
Transient receptor potential cation channel subfamily A member 1
Ligand
BDBM50312085
Substrate
Meas. Tech.
ChEMBL_620934 (CHEMBL1117579)
EC50
>25000±n/a nM
Citation
 Morera, EDe Petrocellis, LMorera, LMoriello, ASLigresti, ANalli, MWoodward, DFDi Marzo, VOrtar, G Synthesis and biological evaluation of piperazinyl carbamates and ureas as fatty acid amide hydrolase (FAAH) and transient receptor potential (TRP) channel dual ligands. Bioorg Med Chem Lett 19:6806-9 (2009)  
Target
Name:
Transient receptor potential cation channel subfamily A member 1
Synonyms:
ANKTM1 TRPA1 Transformation-sensitive protein p120 | Transient receptor potential cation channel subfamily A member 1 (TRPA1)
Type:
Protein
Mol. Mass.:
127514.20
Organism:
Homo sapiens (Human)
Description:
O75762
Residue:
1119
  
Inhibitor
Name:
BDBM50312085
Synonyms:
4-tert-butylphenyl 4-(3-(trifluoromethyl)pyridin-2-yl)piperazine-1-carboxylate | CHEMBL1079443
Type:
Small organic molecule
Emp. Form.:
C21H24F3N3O2
Mol. Mass.:
407.4294
SMILES:
CC(C)(C)c1ccc(OC(=O)N2CCN(CC2)c2ncccc2C(F)(F)F)cc1
: