Target
Fatty-acid amide hydrolase 1 [30-579]
Ligand
BDBM50312085
Substrate
Meas. Tech.
ChEMBL_620931 (CHEMBL1117576)
IC50
30110±n/a nM
Citation
 Morera, EDe Petrocellis, LMorera, LMoriello, ASLigresti, ANalli, MWoodward, DFDi Marzo, VOrtar, G Synthesis and biological evaluation of piperazinyl carbamates and ureas as fatty acid amide hydrolase (FAAH) and transient receptor potential (TRP) channel dual ligands. Bioorg Med Chem Lett 19:6806-9 (2009)  
Target
Name:
Fatty-acid amide hydrolase 1 [30-579]
Synonyms:
Anandamide amidohydrolase 1 Faah Fatty Acid Amide Hydrolase Fatty-acid amide hydrolase (FAAH) Fatty-acid amide hydrolase 1 (FAAH) Oleamide hydrolase 1
Type:
Single-pass membrane protein; homodimer
Mol. Mass.:
60474.00
Organism:
Rattus norvegicus (rat)
Description:
P97612 (aa 30-579)
Residue:
550
  
Inhibitor
Name:
BDBM50312085
Synonyms:
4-tert-butylphenyl 4-(3-(trifluoromethyl)pyridin-2-yl)piperazine-1-carboxylate | CHEMBL1079443
Type:
Small organic molecule
Emp. Form.:
C21H24F3N3O2
Mol. Mass.:
407.4294
SMILES:
CC(C)(C)c1ccc(OC(=O)N2CCN(CC2)c2ncccc2C(F)(F)F)cc1
: