Target
Tumor susceptibility gene 101 protein
Ligand
BDBM50312341
Substrate
Meas. Tech.
ChEMBL_619036 (CHEMBL1102078)
Kd
38000±n/a nM
Citation
 Liu, FStephen, AGWaheed, AAFreed, EOFisher, RJBurke, TR Application of ring-closing metathesis macrocyclization to the development of Tsg101-binding antagonists. Bioorg Med Chem Lett 20:318-21 (2010)  
Target
Name:
Tumor susceptibility gene 101 protein
Synonyms:
TS101_HUMAN | TSG101
Type:
PROTEIN
Mol. Mass.:
43943.30
Organism:
Homo sapiens (Human)
Description:
ChEMBL_800321
Residue:
390
  
Inhibitor
Name:
BDBM50312341
Synonyms:
3,3'-((6S,25S,27aS,32aS,38S,41S,43aS)-23-(2-amino-2-oxoethyl)-10-(5-(3-(3',6'-dihydroxy-3-oxo-3H-spiro[isobenzofuran-1,9'-xanthene]-6-yl)thioureido)pentanoyl)-41-((R)-1-hydroxyethyl)-38-methyl-5,8,24,27,32,37,40,43-octaoxo-2,3,5,6,7,8,9,10,11,12,13,14,17,18,19,20,21,22,23,24,25,26,27,27a,28,29,30,32,32a,33,34,35,37,38,39,40,41,42,43,43a-tetracontahydro-1H-tripyrrolo[2,1-f:2',1'-i:2'',1''-r][1,4,7,10,13,16,19,22,25]nonaazacycloheptatriacontine-6,25-diyl)dipropanoic acid | CHEMBL1075913
Type:
Small organic molecule
Emp. Form.:
C74H96N12O20S
Mol. Mass.:
1505.687
SMILES:
C[C@@H](O)[C@@H]1NC(=O)[C@@H]2CCCN2C(=O)[C@H](CCC(O)=O)NC(=O)CN(CCCC\C=C/CCCCCCN(CC(N)=O)C(=O)[C@H](CCC(O)=O)NC(=O)[C@@H]2CCCN2C(=O)[C@@H]2CCCN2C(=O)[C@H](C)NC1=O)C(=O)CCCCNC(=S)Nc1ccc2C(=O)OC3(c2c1)c1ccc(O)cc1Oc1cc(O)ccc31
: