Target
Peroxisome proliferator-activated receptor alpha
Ligand
BDBM50312421
Substrate
Meas. Tech.
ChEMBL_620646 (CHEMBL1114854)
EC50
2600±n/a nM
Citation
 Epple, RCow, CXie, YAzimioara, MRusso, RWang, XWityak, JKaranewsky, DSTuntland, TNguyêñ-Trân, VTCuc Ngo, CHuang, DSaez, ESpalding, TGerken, AIskandar, MSeidel, HMTian, SS Novel bisaryl substituted thiazoles and oxazoles as highly potent and selective peroxisome proliferator-activated receptor delta agonists. J Med Chem 53:77-105 (2010)  
Target
Name:
Peroxisome proliferator-activated receptor alpha
Synonyms:
NR1C1 PPAR PPAR-alpha PPARA_HUMAN Peroxisome proliferator-activated receptor | Peroxisome proliferator-activated receptor alpha (PPAR alpha)
Type:
Enzyme
Mol. Mass.:
52222.08
Organism:
Homo sapiens (Human)
Description:
Q07869
Residue:
468
  
Inhibitor
Name:
BDBM50312421
Synonyms:
2-(4-((4-(4-Isopropoxyphenyl)-5-(4-(trifluoromethoxy)phenyl)-oxazol-2-yl)methoxy)-2-methylphenoxy)acetic Acid | CHEMBL1080368
Type:
Small organic molecule
Emp. Form.:
C29H26F3NO7
Mol. Mass.:
557.5144
SMILES:
CC(C)Oc1ccc(cc1)-c1nc(COc2ccc(OCC(O)=O)c(C)c2)oc1-c1ccc(OC(F)(F)F)cc1
: