Target
Peroxisome proliferator-activated receptor delta
Ligand
BDBM50312475
Substrate
Meas. Tech.
ChEMBL_620660 (CHEMBL1115681)
EC50
13±n/a nM
Citation
 Epple, RCow, CXie, YAzimioara, MRusso, RWang, XWityak, JKaranewsky, DSTuntland, TNguyêñ-Trân, VTCuc Ngo, CHuang, DSaez, ESpalding, TGerken, AIskandar, MSeidel, HMTian, SS Novel bisaryl substituted thiazoles and oxazoles as highly potent and selective peroxisome proliferator-activated receptor delta agonists. J Med Chem 53:77-105 (2010)  
Target
Name:
Peroxisome proliferator-activated receptor delta
Synonyms:
NUC1 Nuclear hormone receptor 1 PPAR-beta PPARD_MOUSE Ppard
Type:
PROTEIN
Mol. Mass.:
49719.14
Organism:
Mus musculus
Description:
ChEMBL_1288931
Residue:
440
  
Inhibitor
Name:
BDBM50312475
Synonyms:
2-(4-((4-(6-Isopropoxypyridin-3-yl)-5-(4-(trifluoromethoxy)-phenyl)thiazol-2-yl)methoxy)-2-methylphenoxy)acetic Acid | CHEMBL1079505
Type:
Small organic molecule
Emp. Form.:
C28H25F3N2O6S
Mol. Mass.:
574.568
SMILES:
CC(C)Oc1ccc(cn1)-c1nc(COc2ccc(OCC(O)=O)c(C)c2)sc1-c1ccc(OC(F)(F)F)cc1
: