Target
Peroxisome proliferator-activated receptor alpha
Ligand
BDBM50312460
Substrate
Meas. Tech.
ChEMBL_620646 (CHEMBL1114854)
EC50
800±n/a nM
Citation
 Epple, RCow, CXie, YAzimioara, MRusso, RWang, XWityak, JKaranewsky, DSTuntland, TNguyêñ-Trân, VTCuc Ngo, CHuang, DSaez, ESpalding, TGerken, AIskandar, MSeidel, HMTian, SS Novel bisaryl substituted thiazoles and oxazoles as highly potent and selective peroxisome proliferator-activated receptor delta agonists. J Med Chem 53:77-105 (2010)  
Target
Name:
Peroxisome proliferator-activated receptor alpha
Synonyms:
NR1C1 PPAR PPAR-alpha PPARA_HUMAN Peroxisome proliferator-activated receptor | Peroxisome proliferator-activated receptor alpha (PPAR alpha)
Type:
Enzyme
Mol. Mass.:
52222.08
Organism:
Homo sapiens (Human)
Description:
Q07869
Residue:
468
  
Inhibitor
Name:
BDBM50312460
Synonyms:
2-(4-(4-(4,5-Bis(4-methoxyphenyl)thiazol-2-ylthio)butoxy)-3-chlorophenyl)acetic Acid | CHEMBL1079961
Type:
Small organic molecule
Emp. Form.:
C29H28ClNO6S2
Mol. Mass.:
586.119
SMILES:
COc1ccc(cc1)-c1nc(SCCCCOc2ccc(OCC(O)=O)cc2Cl)sc1-c1ccc(OC)cc1
: