Target
Lactase/phlorizin hydrolase
Ligand
BDBM50312525
Substrate
Meas. Tech.
ChEMBL_617532 (CHEMBL1099882)
IC50
>1000000±n/a nM
Citation
 Wennekes, TMeijer, AJGroen, AKBoot, RGGroener, JEvan Eijk, MOttenhoff, RBijl, NGhauharali, KSong, HO'Shea, TJLiu, HYew, NCopeland, Dvan den Berg, RJvan der Marel, GAOverkleeft, HSAerts, JM Dual-action lipophilic iminosugar improves glycemic control in obese rodents by reduction of visceral glycosphingolipids and buffering of carbohydrate assimilation. J Med Chem 53:689-98 (2010)  
Target
Name:
Lactase/phlorizin hydrolase
Synonyms:
LCT LPH_HUMAN | Lactase-phlorizin hydrolase
Type:
PROTEIN
Mol. Mass.:
218576.40
Organism:
Homo sapiens (Human)
Description:
ChEMBL_1435478
Residue:
1927
  
Inhibitor
Name:
BDBM50312525
Synonyms:
(2S,3R,4R,5S)-2-Hydroxymethyl-piperidine-3,4,5-triol CHEMBL175901 | L-ido-1-Deoxynojirimycin
Type:
Small organic molecule
Emp. Form.:
C6H13NO4
Mol. Mass.:
163.1717
SMILES:
OC[C@@H]1NC[C@H](O)[C@@H](O)[C@@H]1O
: