Target
Non-lysosomal glucosylceramidase
Ligand
BDBM50163440
Substrate
Meas. Tech.
ChEMBL_617534 (CHEMBL1099884)
IC50
100000±n/a nM
Citation
 Wennekes, TMeijer, AJGroen, AKBoot, RGGroener, JEvan Eijk, MOttenhoff, RBijl, NGhauharali, KSong, HO'Shea, TJLiu, HYew, NCopeland, Dvan den Berg, RJvan der Marel, GAOverkleeft, HSAerts, JM Dual-action lipophilic iminosugar improves glycemic control in obese rodents by reduction of visceral glycosphingolipids and buffering of carbohydrate assimilation. J Med Chem 53:689-98 (2010)  
Target
Name:
Non-lysosomal glucosylceramidase
Synonyms:
Beta-glucosidase GBA2_HUMAN SPG46
Type:
PROTEIN
Mol. Mass.:
104639.04
Organism:
Homo sapiens (Human)
Description:
ChEMBL_1435476
Residue:
927
  
Inhibitor
Name:
BDBM50163440
Synonyms:
(2R,3S,4R,5S)-2-(hydroxymethyl)piperidine-3,4,5-triol 1-deoxygalactonojirimycin D-galacto-1-Deoxynojirimycin | DGJ
Type:
Small organic molecule
Emp. Form.:
C6H13NO4
Mol. Mass.:
163.1717
SMILES:
OC[C@H]1NC[C@H](O)[C@@H](O)[C@H]1O
: