Target
Glycogen debranching enzyme
Ligand
BDBM50312530
Substrate
Meas. Tech.
ChEMBL_617536 (CHEMBL1099886)
IC50
>100000±n/a nM
Citation
 Wennekes, TMeijer, AJGroen, AKBoot, RGGroener, JEvan Eijk, MOttenhoff, RBijl, NGhauharali, KSong, HO'Shea, TJLiu, HYew, NCopeland, Dvan den Berg, RJvan der Marel, GAOverkleeft, HSAerts, JM Dual-action lipophilic iminosugar improves glycemic control in obese rodents by reduction of visceral glycosphingolipids and buffering of carbohydrate assimilation. J Med Chem 53:689-98 (2010)  
Target
Name:
Glycogen debranching enzyme
Synonyms:
AGL GDE_HUMAN
Type:
PROTEIN
Mol. Mass.:
174768.28
Organism:
Homo sapiens (Human)
Description:
ChEMBL_491004
Residue:
1532
  
Inhibitor
Name:
BDBM50312530
Synonyms:
CHEMBL1088291 | N-Butyl-L-altro-1-deoxynojirimycin
Type:
Small organic molecule
Emp. Form.:
C10H21NO4
Mol. Mass.:
219.278
SMILES:
CCCCN1C[C@H](O)[C@@H](O)[C@@H](O)[C@@H]1CO
: