Target
Sialidase-2
Ligand
BDBM11318
Substrate
Meas. Tech.
ChEMBL_617801 (CHEMBL1100507)
IC50
760000±n/a nM
Citation
 Arioka, SSakagami, MUematsu, RYamaguchi, HTogame, HTakemoto, HHinou, HNishimura, S Potent inhibitor scaffold against Trypanosoma cruzi trans-sialidase. Bioorg Med Chem 18:1633-40 (2010)  
Target
Name:
Sialidase-2
Synonyms:
Cytosolic sialidase NEU2 Sialidase 2 | Sialidase-2
Type:
PROTEIN
Mol. Mass.:
42256.20
Organism:
Homo sapiens (Human)
Description:
ChEMBL_960638
Residue:
380
  
Inhibitor
Name:
BDBM11318
Synonyms:
1,3,8-trihydroxy-6-methyl-9,10-dihydroanthracene-9,10-dione CHEMBL289277 US20230364057, Compound 242 | med.21724, Compound 24
Type:
Small organic molecule
Emp. Form.:
C15H10O5
Mol. Mass.:
270.2369
SMILES:
Cc1cc(O)c2C(=O)c3c(O)cc(O)cc3C(=O)c2c1
: