Target
Prothrombin
Ligand
BDBM50312652
Substrate
Meas. Tech.
ChEMBL_617811 (CHEMBL1100517)
Ki
2.3±n/a nM
Citation
 Lu, TMarkotan, TBallentine, SKGiardino, ECSpurlino, JCrysler, CSBrown, KMaryanoff, BETomczuk, BEDamiano, BPShukla, UEnd, DAndrade-Gordon, PBone, RFPlayer, MR Discovery and clinical evaluation of 1-{N-[2-(amidinoaminooxy)ethyl]amino}carbonylmethyl-6-methyl-3-[2,2-difluoro-2-phenylethylamino]pyrazinone (RWJ-671818), a thrombin inhibitor with an oxyguanidine P1 motif. J Med Chem 53:1843-56 (2010)  
Target
Name:
Prothrombin
Synonyms:
Activation peptide fragment 1 Coagulation factor II Prothrombin precursor Thrombin heavy chain | Thrombin light chain
Type:
Protein
Mol. Mass.:
70029.57
Organism:
Homo sapiens (Human)
Description:
P00734
Residue:
622
  
Inhibitor
Name:
BDBM50312652
Synonyms:
1-{N-[2-(Amidinoaminooxy)ethyl]amino}carbonylmethyl-6-cyano-3-[2,2-difluoro-2-phenylethylamino]pyrazinone | CHEMBL1084908
Type:
Small organic molecule
Emp. Form.:
C18H20F2N8O3
Mol. Mass.:
434.4
SMILES:
[#7]\[#6](-[#7])=[#7]\[#8]-[#6]-[#6]-[#7]-[#6](=O)-[#6]-n1c(cnc(-[#7]-[#6]C(F)(F)c2ccccc2)c1=O)C#N
: