Target
Stearoyl-CoA desaturase
Ligand
BDBM50312702
Substrate
Meas. Tech.
ChEMBL_615425 (CHEMBL1106892)
IC50
1±n/a nM
Citation
 Ramtohul, YKBlack, CChan, CCCrane, SGuay, JGuiral, SHuang, ZOballa, RXu, LJZhang, LLi, CS SAR and optimization of thiazole analogs as potent stearoyl-CoA desaturase inhibitors. Bioorg Med Chem Lett 20:1593-7 (2010)  
Target
Name:
Stearoyl-CoA desaturase
Synonyms:
Acyl-CoA desaturase SCD SCDOS Stearoyl-CoA (SCD1) | Stearoyl-CoA desaturase 1
Type:
Enzyme
Mol. Mass.:
41537.27
Organism:
Homo sapiens (Human)
Description:
O00767
Residue:
359
  
Inhibitor
Name:
BDBM50312702
Synonyms:
(3-(2-(4-(2-(trifluoromethyl)phenoxy)piperidin-1-yl)thiazol-5-yl)-1,2,4-oxadiazol-5-yl)methanol | CHEMBL1087015
Type:
Small organic molecule
Emp. Form.:
C18H17F3N4O3S
Mol. Mass.:
426.413
SMILES:
OCc1nc(no1)-c1cnc(s1)N1CCC(CC1)Oc1ccccc1C(F)(F)F
: