Target
Macrophage colony-stimulating factor 1 receptor
Ligand
BDBM50312737
Substrate
Meas. Tech.
ChEMBL_615642 (CHEMBL1104216)
IC50
345±n/a nM
Citation
 Meyers, MJPelc, MKamtekar, SDay, JPoda, GIHall, MKMichener, MLReitz, BAMathis, KJPierce, BSParikh, MDMischke, DALong, SAParlow, JJAnderson, DRThorarensen, A Structure-based drug design enables conversion of a DFG-in binding CSF-1R kinase inhibitor to a DFG-out binding mode. Bioorg Med Chem Lett 20:1543-7 (2010)  
Target
Name:
Macrophage colony-stimulating factor 1 receptor
Synonyms:
CSF1R FMS Macrophage colony stimulating factor receptor Macrophage colony-stimulating factor 1 receptor (c-FMS) Proto-oncogene c-Fms c-fms | cFMS
Type:
Protein
Mol. Mass.:
107979.48
Organism:
Homo sapiens (Human)
Description:
P07333
Residue:
972
  
Inhibitor
Name:
BDBM50312737
Synonyms:
CHEMBL1088040 | N2-(2,6-dichlorobenzyl)-6-(1-methyl-1H-pyrazol-4-yl)pyrazine-2,3-diamine
Type:
Small organic molecule
Emp. Form.:
C15H14Cl2N6
Mol. Mass.:
349.218
SMILES:
Cn1cc(cn1)-c1cnc(N)c(NCc2c(Cl)cccc2Cl)n1
: