Target
Prostaglandin D2 receptor 2
Ligand
BDBM50312906
Substrate
Meas. Tech.
ChEMBL_615899 (CHEMBL1102913)
IC50
7.5±n/a nM
Citation
 Grimstrup, MReceveur, JMRist, ØFrimurer, TMNielsen, PAMathiesen, JMHögberg, T Exploration of SAR features by modifications of thiazoleacetic acids as CRTH2 antagonists. Bioorg Med Chem Lett 20:1638-41 (2010)  
Target
Name:
Prostaglandin D2 receptor 2
Synonyms:
Crth2 Gpr44 Ptgdr2
Type:
PROTEIN
Mol. Mass.:
45345.57
Organism:
Rattus norvegicus
Description:
ChEMBL_749146
Residue:
403
  
Inhibitor
Name:
BDBM50312906
Synonyms:
2-(2-(bis(4-fluorophenyl)methyl)-4-(3-fluorophenyl)pyrimidin-5-yl)acetic acid | CHEMBL1088284
Type:
Small organic molecule
Emp. Form.:
C25H17F3N2O2
Mol. Mass.:
434.4099
SMILES:
OC(=O)Cc1cnc(nc1-c1cccc(F)c1)C(c1ccc(F)cc1)c1ccc(F)cc1
: