Target
Adenosine receptor A2b
Ligand
BDBM50312964
Substrate
Meas. Tech.
ChEMBL_616078 (CHEMBL1102041)
Ki
7±n/a nM
Citation
 Eastwood, PGonzalez, JParedes, SNueda, ADomenech, TAlberti, JVidal, B Discovery of N-(5,6-diarylpyridin-2-yl)amide derivatives as potent and selective A(2B) adenosine receptor antagonists. Bioorg Med Chem Lett 20:1697-700 (2010)  
Target
Name:
Adenosine receptor A2b
Synonyms:
AA2BR_HUMAN ADORA2B Adenosine receptors A2b | Adenosine receptors; A2a & A2b
Type:
G Protein-Coupled Receptor (GPCR)
Mol. Mass.:
36341.22
Organism:
Homo sapiens (Human)
Description:
Residue:
332
  
Inhibitor
Name:
BDBM50312964
Synonyms:
CHEMBL1081811 | N-(2-(furan-2-yl)-3,4'-bipyridin-6-yl)acetamide
Type:
Small organic molecule
Emp. Form.:
C16H13N3O2
Mol. Mass.:
279.2933
SMILES:
CC(=O)Nc1ccc(-c2ccncc2)c(n1)-c1ccco1
: