Target
Adenosine receptor A3
Ligand
BDBM50312965
Substrate
Meas. Tech.
ChEMBL_616081 (CHEMBL1102044)
Ki
1337±n/a nM
Citation
 Eastwood, PGonzalez, JParedes, SNueda, ADomenech, TAlberti, JVidal, B Discovery of N-(5,6-diarylpyridin-2-yl)amide derivatives as potent and selective A(2B) adenosine receptor antagonists. Bioorg Med Chem Lett 20:1697-700 (2010)  
Target
Name:
Adenosine receptor A3
Synonyms:
A3 adenosine receptor (hA3) ADORA3 | Adenosine A3 receptor (A3AR)
Type:
G Protein-Coupled Receptor (GPCR)
Mol. Mass.:
36197.32
Organism:
Homo sapiens (Human)
Description:
P0DMS8
Residue:
318
  
Inhibitor
Name:
BDBM50312965
Synonyms:
CHEMBL1081812 | N-(2-(furan-2-yl)-3,4'-bipyridin-6-yl)cyclopropanecarboxamide
Type:
Small organic molecule
Emp. Form.:
C18H15N3O2
Mol. Mass.:
305.3306
SMILES:
O=C(Nc1ccc(-c2ccncc2)c(n1)-c1ccco1)C1CC1
: