Target
Type-1 angiotensin II receptor
Ligand
BDBM50313247
Substrate
Meas. Tech.
ChEMBL_617060 (CHEMBL1100566)
Ki
0.8±n/a nM
Citation
 Fillion, DLemieux, GBasambombo, LLLavigne, PGuillemette, GLeduc, REscher, E The amino-terminus of angiotensin II contacts several ectodomains of the angiotensin II receptor AT1. J Med Chem 53:2063-75 (2010)  
Target
Name:
Type-1 angiotensin II receptor
Synonyms:
AGTR1 AGTR1B AT1 AT1BR AT2R1B Angiotensin II receptor Type-1 angiotensin II receptor (AT1)
Type:
Protein
Mol. Mass.:
41080.75
Organism:
Homo sapiens (Human)
Description:
P30556
Residue:
359
  
Inhibitor
Name:
BDBM50313247
Synonyms:
CHEMBL1076632 | [Sar1,Bpa8]AngII
Type:
Small organic molecule
Emp. Form.:
C56H75N13O11
Mol. Mass.:
1106.2752
SMILES:
CC[C@H](C)[C@H](NC(=O)[C@H](Cc1ccc(O)cc1)NC(=O)[C@@H](NC(=O)[C@H](CCCN=C(N)N)NC(=O)CNC)C(C)C)C(=O)N[C@@H](Cc1cnc[nH]1)C(=O)N1CCC[C@H]1C(=O)N[C@@H](Cc1ccc(cc1)C(=O)c1ccccc1)C(O)=O
: