Target
Cytochrome P450 2C9
Ligand
BDBM50313248
Substrate
Meas. Tech.
ChEMBL_617096 (CHEMBL1101354)
IC50
9700±n/a nM
Citation
 Kang, SYPark, EJPark, WKKim, HJJeong, DJung, MESong, KSLee, SHSeo, HJKim, MJLee, MHan, HKSon, EJPae, ANKim, JLee, J Arylpiperazine-containing pyrrole 3-carboxamide derivatives targeting serotonin 5-HT(2A), 5-HT(2C), and the serotonin transporter as a potential antidepressant. Bioorg Med Chem Lett 20:1705-11 (2010)  
Target
Name:
Cytochrome P450 2C9
Synonyms:
(R)-limonene 6-monooxygenase CP2C9_HUMAN CYP2C9 Cytochrome P450 2C9 (CYP2C9 ) P-450MP P450 PB-1 | S-mephenytoin 4-hydroxylase
Type:
Enzyme
Mol. Mass.:
55636.33
Organism:
Homo sapiens (Human)
Description:
P11712
Residue:
490
  
Inhibitor
Name:
BDBM50313248
Synonyms:
CHEMBL1086754 N-(3-(4-(2,3-dichlorophenyl)piperazin-1-yl)propyl)-1,2-dimethyl-5-phenyl-1H-pyrrole-3-carboxamide hydrchloride
Type:
Small organic molecule
Emp. Form.:
C26H30Cl2N4O
Mol. Mass.:
485.449
SMILES:
Cc1c(cc(-c2ccccc2)n1C)C(=O)NCCCN1CCN(CC1)c1cccc(Cl)c1Cl
: