Target
Sphingosine 1-phosphate receptor 1
Ligand
BDBM50313337
Substrate
Meas. Tech.
ChEMBL_617125 (CHEMBL1101383)
EC50
65±n/a nM
Citation
 Crosignani, SBombrun, ACovini, DMaio, MMarin, DQuattropani, ASwinnen, DSimpson, DSauer, WFrançon, BMartin, TCambet, YNichols, AMartinou, IBurgat-Charvillon, FRivron, DDonini, CSchott, OEligert, VNovo-Perez, LVitte, PAArrighi, JF Discovery of a novel series of potent S1P1 agonists. Bioorg Med Chem Lett 20:1516-9 (2010)  
Target
Name:
Sphingosine 1-phosphate receptor 1
Synonyms:
CHEDG1 Endothelial differentiation G-protein coupled receptor 1 S1P1 S1PR1_HUMAN Sphingosine 1-phosphate receptor Edg-1
Type:
Enzyme
Mol. Mass.:
42836.02
Organism:
Homo sapiens (Human)
Description:
P21453
Residue:
382
  
Inhibitor
Name:
BDBM50313337
Synonyms:
6-(cyclohexyl(methyl)amino)-N-(2-methyl-4-sulfamoylphenyl)pyrimidine-4-carboxamide US9150519, 1-29
Type:
Small organic molecule
Emp. Form.:
C19H25N5O3S
Mol. Mass.:
403.499
SMILES:
CN(C1CCCCC1)c1cc(ncn1)C(=O)Nc1ccc(cc1C)S(N)(=O)=O
: