Target
Sphingosine 1-phosphate receptor 1
Ligand
BDBM50313338
Substrate
Meas. Tech.
ChEMBL_617125 (CHEMBL1101383)
EC50
1.6±n/a nM
Citation
 Crosignani, SBombrun, ACovini, DMaio, MMarin, DQuattropani, ASwinnen, DSimpson, DSauer, WFrançon, BMartin, TCambet, YNichols, AMartinou, IBurgat-Charvillon, FRivron, DDonini, CSchott, OEligert, VNovo-Perez, LVitte, PAArrighi, JF Discovery of a novel series of potent S1P1 agonists. Bioorg Med Chem Lett 20:1516-9 (2010)  
Target
Name:
Sphingosine 1-phosphate receptor 1
Synonyms:
CHEDG1 Endothelial differentiation G-protein coupled receptor 1 S1P1 S1PR1_HUMAN Sphingosine 1-phosphate receptor Edg-1
Type:
Enzyme
Mol. Mass.:
42836.02
Organism:
Homo sapiens (Human)
Description:
P21453
Residue:
382
  
Inhibitor
Name:
BDBM50313338
Synonyms:
6-(cyclohexyl(cyclopropylmethyl)amino)-N-(2-methyl-4-sulfamoylphenyl)pyrimidine-4-carboxamide US9150519, 1-38
Type:
Small organic molecule
Emp. Form.:
C22H29N5O3S
Mol. Mass.:
443.562
SMILES:
Cc1cc(ccc1NC(=O)c1cc(ncn1)N(CC1CC1)C1CCCCC1)S(N)(=O)=O
: