Target
Sphingosine 1-phosphate receptor 4
Ligand
BDBM50313499
Substrate
Meas. Tech.
ChEMBL_617668 (CHEMBL1101464)
EC50
5.7±n/a nM
Citation
 Högenauer, KHinterding, KNussbaumer, P S1P receptor mediated activity of FTY720 phosphate mimics. Bioorg Med Chem Lett 20:1485-7 (2010)  
Target
Name:
Sphingosine 1-phosphate receptor 4
Synonyms:
EDG6 S1P receptor 4 S1P4 S1PR4_HUMAN Sphingosine 1-phosphate receptor Edg-6 sphingosine-1-phosphate 4 S1P4
Type:
G Protein-Coupled Receptor (GPCR)
Mol. Mass.:
41647.39
Organism:
Homo sapiens (Human)
Description:
Residue:
384
  
Inhibitor
Name:
BDBM50313499
Synonyms:
(S)-2-amino-4-(4-(heptyloxy)phenyl)-2-methylbutyl dihydrogen phosphate | CHEMBL1084929
Type:
Small organic molecule
Emp. Form.:
C18H32NO5P
Mol. Mass.:
373.4241
SMILES:
CCCCCCCOc1ccc(CC[C@](C)(N)COP(O)(O)=O)cc1
: