Target
Cathepsin K
Ligand
BDBM50313509
Substrate
Meas. Tech.
ChEMBL_617674 (CHEMBL1101470)
IC50
>10000±n/a nM
Citation
 Rankovic, ZCai, JFradera, XDempster, MMistry, AMitchell, ALong, CHamilton, EKing, ABoucharens, SJamieson, CGillespie, JCumming, IUitdehaag, Jvan Zeeland, M Dioxo-triazines as a novel series of cathepsin K inhibitors. Bioorg Med Chem Lett 20:1488-90 (2010)  
Target
Name:
Cathepsin K
Synonyms:
CATK_HUMAN CTSO Cathepsin O Cathepsin X
Type:
Enzyme
Mol. Mass.:
36975.68
Organism:
Homo sapiens (Human)
Description:
P43235
Residue:
329
  
Inhibitor
Name:
BDBM50313509
Synonyms:
2-(biphenyl-3-yl)-3,5-dioxo-4-propyl-2,3,4,5-tetrahydro-1,2,4-triazine-6-carbonitrile | CHEMBL1078872
Type:
Small organic molecule
Emp. Form.:
C19H16N4O2
Mol. Mass.:
332.3559
SMILES:
CCCn1c(=O)c(nn(-c2cccc(c2)-c2ccccc2)c1=O)C#N
: