Target
Protein kinase C theta type
Ligand
BDBM50313596
Substrate
Meas. Tech.
ChEMBL_614192 (CHEMBL1105142)
IC50
0.840000±n/a nM
Citation
 Boschelli, DHSubrath, JNiu, CWu, BWang, YLee, JBrennan, AHo, MDeng, BYang, XXu, XLeung, LWang, JAtherton, JChaudhary, D Optimization of 5-vinylaryl-3-pyridinecarbonitriles as PKCtheta inhibitors. Bioorg Med Chem Lett 20:1965-8 (2010)  
Target
Name:
Protein kinase C theta type
Synonyms:
KPCT_HUMAN PRKCT Protein kinase C theta type (PRKCQ) nPKC-theta
Type:
Serine/threonine-protein kinase
Mol. Mass.:
81878.04
Organism:
Homo sapiens (Human)
Description:
Full-length human PKC theta (Panvera Catalog No. P2996).
Residue:
706
  
Inhibitor
Name:
BDBM50313596
Synonyms:
(E)-5-(2-(6-((4-(dimethylamino)piperidin-1-yl)methyl)pyridin-2-yl)vinyl)-4-(4-methyl-1H-indol-5-ylamino)nicotinonitrile | CHEMBL1088737
Type:
Small organic molecule
Emp. Form.:
C30H33N7
Mol. Mass.:
491.6299
SMILES:
CN(C)C1CCN(Cc2cccc(\C=C\c3cncc(C#N)c3Nc3ccc4[nH]ccc4c3C)n2)CC1
: