Target
Breakpoint cluster region protein/Tyrosine-protein kinase ABL1
Ligand
BDBM50313644
Substrate
Meas. Tech.
ChEMBL_614493 (CHEMBL1110561)
IC50
8±n/a nM
Citation
 Morphy, R Selectively nonselective kinase inhibition: striking the right balance. J Med Chem 53:1413-37 (2010)  
Target
Name:
Breakpoint cluster region protein/Tyrosine-protein kinase ABL1
Synonyms:
Bcr-Abl Breakpoint cluster region protein /Tyrosine-protein kinase ABL | Tyrosine-protein kinase ABL1/Breakpoint cluster region protein
Type:
Enzyme
Mol. Mass.:
Description:
Components:
This complex has 2 components.
Component 1
Name:
Tyrosine-protein kinase ABL1
Synonyms:
ABL ABL1_HUMAN JTK7 Proto-oncogene tyrosine-protein kinase ABL1 Tyrosine-protein kinase ABL V-abl Abelson murine leukemia viral oncogene homolog 1 p150 | tyrosine-protein kinase ABL1 isoform a
Type:
Enzyme
Mol. Mass.:
122897.30
Organism:
Homo sapiens (Human)
Description:
P00519
Residue:
1130
  
Component 2
Name:
Breakpoint cluster region protein
Synonyms:
BCR BCR_HUMAN Breakpoint cluster region protein | D22S11
Type:
PROTEIN
Mol. Mass.:
142824.75
Organism:
Homo sapiens (Human)
Description:
ChEMBL_305348
Residue:
1271
  
Inhibitor
Name:
BDBM50313644
Synonyms:
(E)-3-(2-(6-(cyclopropylamino)-7H-purin-9(8H)-yl)vinyl)-4-methyl-N-(3-(4-methyl-1H-imidazol-1-yl)-5-(trifluoromethyl)phenyl)benzamide | CHEMBL1077317
Type:
Small organic molecule
Emp. Form.:
C29H27F3N8O
Mol. Mass.:
560.5729
SMILES:
Cc1cn(cn1)-c1cc(NC(=O)c2ccc(C)c(\C=C\N3CNc4c3ncnc4NC3CC3)c2)cc(c1)C(F)(F)F
: