Target
Vascular endothelial growth factor receptor 2
Ligand
BDBM50313645
Substrate
Meas. Tech.
ChEMBL_614496 (CHEMBL1110564)
IC50
12±n/a nM
Citation
 Morphy, R Selectively nonselective kinase inhibition: striking the right balance. J Med Chem 53:1413-37 (2010)  
Target
Name:
Vascular endothelial growth factor receptor 2
Synonyms:
CD_antigen=CD309 Fetal liver kinase 1 (FLK-1) KDR Protein-tyrosine kinase receptor Flk-1 VEGFR-2 VEGFR2 Vascular Endothelial Growth Factor Receptor Kinase 2 Vascular endothelial growth factor receptor 2 (KDR) Vascular endothelial growth factor receptor 2 (VEGFR2) Vascular endothelial growth factor receptor-2 (VEGFR-2)
Type:
Receptor Tyrosine Kinase
Mol. Mass.:
151510.97
Organism:
Homo sapiens (Human)
Description:
P35968
Residue:
1356
  
Inhibitor
Name:
BDBM50313645
Synonyms:
1-cyclopentyl-3-(1H-pyrrolo[2,3-b]pyridin-5-yl)-1H-pyrazolo[3,4-d]pyrimidin-4-amine | CHEMBL1081312
Type:
Small organic molecule
Emp. Form.:
C17H17N7
Mol. Mass.:
319.3638
SMILES:
Nc1ncnc2n(nc(-c3cnc4[nH]ccc4c3)c12)C1CCCC1
: