Target
Ribosomal protein S6 kinase alpha-5
Ligand
BDBM24989
Substrate
Meas. Tech.
ChEMBL_614511 (CHEMBL1111484)
IC50
21±n/a nM
Citation
 Morphy, R Selectively nonselective kinase inhibition: striking the right balance. J Med Chem 53:1413-37 (2010)  
Target
Name:
Ribosomal protein S6 kinase alpha-5
Synonyms:
90 kDa ribosomal protein S6 kinase 5 MSK1 Nuclear mitogen- and stress-activated protein kinase 1 RPS6KA5 RSK-like protein kinase Ribosomal protein S6 kinase Ribosomal protein S6 kinase alpha-5
Type:
Serine/threonine-protein kinase
Mol. Mass.:
89874.44
Organism:
Homo sapiens (Human)
Description:
Residue:
802
  
Inhibitor
Name:
BDBM24989
Synonyms:
4-[1-ethyl-7-(piperidin-4-yloxy)-1H-imidazo[4,5-c]pyridin-2-yl]-1,2,5-oxadiazol-3-amine | oxadiazole-containing compound, 1
Type:
Small organic molecule
Emp. Form.:
C15H19N7O2
Mol. Mass.:
329.3571
SMILES:
CCn1c(nc2cncc(OC3CCNCC3)c12)-c1nonc1N
: