Target
Epidermal growth factor receptor
Ligand
BDBM50313647
Substrate
Meas. Tech.
ChEMBL_614501 (CHEMBL1111474)
IC50
81.0±n/a nM
Citation
 Morphy, R Selectively nonselective kinase inhibition: striking the right balance. J Med Chem 53:1413-37 (2010)  
Target
Name:
Epidermal growth factor receptor
Synonyms:
EGF Receptor Substrate EGFR_HUMAN ERBB1 Epidermal Growth Factor Receptor erbB-1 Epidermal growth factor receptor (EGFR) HER1 Proto-oncogene c-ErbB-1 Tyrosine-Protein Kinase ErbB-1
Type:
Receptor Kinase Domain
Mol. Mass.:
134279.59
Organism:
Homo sapiens (Human)
Description:
P00533
Residue:
1210
  
Inhibitor
Name:
BDBM50313647
Synonyms:
3-(2-(2-chlorobenzyl)-1H-benzo[d]imidazol-6-yl)-1-((1r,4r)-4-(1-(3-methoxypropyl)piperidin-4-yl)cyclohexyl)-1H-pyrazolo[3,4-d]pyrimidin-4-amine | CHEMBL2374457
Type:
Small organic molecule
Emp. Form.:
C34H41ClN8O
Mol. Mass.:
613.195
SMILES:
COCCCN1CCC(CC1)[C@H]1CC[C@@H](CC1)n1nc(-c2ccc3nc(Cc4ccccc4Cl)[nH]c3c2)c2c(N)ncnc12
: