Target
Nitric oxide synthase, inducible
Ligand
BDBM50275756
Substrate
Meas. Tech.
ChEMBL_614522 (CHEMBL1111497)
IC50
313000±n/a nM
Citation
 Morphy, R Selectively nonselective kinase inhibition: striking the right balance. J Med Chem 53:1413-37 (2010)  
Target
Name:
Nitric oxide synthase, inducible
Synonyms:
HEP-NOS Inducible NO synthase NOS type II NOS2A Nitric oxide synthase, inducible (iNOS) | iNOS
Type:
Homodimer
Mol. Mass.:
131141.95
Organism:
Homo sapiens (Human)
Description:
P35228
Residue:
1153
  
Inhibitor
Name:
BDBM50275756
Synonyms:
4-(2-aminobenzo[d]thiazol-6-ylamino)-6-methyl-7-(2-(piperidin-1-yl)ethoxy)quinoline-3-carbonitrile | CHEMBL486370
Type:
Small organic molecule
Emp. Form.:
C25H26N6OS
Mol. Mass.:
458.579
SMILES:
Cc1cc2c(Nc3ccc4nc(N)sc4c3)c(cnc2cc1OCCN1CCCCC1)C#N
: